Skip to content

CMake Build Matrix #2528

CMake Build Matrix

CMake Build Matrix #2528

Triggered via push April 25, 2024 08:03
Status Failure
Total duration 3h 15m 5s
Artifacts

build_cmake.yml

on: push
Ubuntu 20.04 ARM64 Clang 10
3h 14m
Ubuntu 20.04 ARM64 Clang 10
Matrix: build
Fit to window
Zoom out
Zoom in

Annotations

7 errors and 4 warnings
Windows Latest MSVC
99% tests passed, 1 tests failed out of 67 Label Time Summary: GTest = 24.96 sec*proc (63 tests) IntegrationTest = 15.15 sec*proc (19 tests) MpiTest = 4.44 sec*proc (9 tests) QuickGpuTest = 3.82 sec*proc (12 tests) SlowGpuTest = 75.42 sec*proc (14 tests) SlowTest = 8.42 sec*proc (7 tests) UnitTest = 1.38 sec*proc (37 tests) Total Test time (real) = 89.32 sec The following tests FAILED: 64 - regressiontests/complex (Failed) Errors while running CTest
Windows Latest MSVC
Process completed with exit code 1.
macOS 11 gcc with OpenCL
99% tests passed, 1 tests failed out of 87 Label Time Summary: GTest = 45.30 sec*proc (81 tests) IntegrationTest = 17.36 sec*proc (25 tests) MpiTest = 15.42 sec*proc (19 tests) QuickGpuTest = 17.29 sec*proc (17 tests) SlowGpuTest = 85.42 sec*proc (18 tests) SlowTest = 12.31 sec*proc (13 tests) UnitTest = 15.63 sec*proc (43 tests) Total Test time (real) = 124.13 sec The following tests FAILED: 84 - regressiontests/complex (Failed) Errors while running CTest
macOS 11 gcc with OpenCL
Process completed with exit code 1.
macOS Latest Clang
99% tests passed, 1 tests failed out of 81 Label Time Summary: GTest = 29.86 sec*proc (75 tests) IntegrationTest = 15.88 sec*proc (25 tests) MpiTest = 4.91 sec*proc (13 tests) QuickGpuTest = 7.49 sec*proc (15 tests) SlowGpuTest = 73.79 sec*proc (14 tests) SlowTest = 8.34 sec*proc (7 tests) UnitTest = 5.63 sec*proc (43 tests) Total Test time (real) = 95.93 sec The following tests FAILED: 78 - regressiontests/complex (Failed) Errors while running CTest
macOS Latest Clang
Process completed with exit code 1.
Ubuntu 20.04 ARM64 Clang 10
The process '/home/runner/work/_actions/uraimo/run-on-arch-action/v2/src/run-on-arch.sh' failed with exit code 1
Windows Latest MSVC
Node.js 16 actions are deprecated. Please update the following actions to use Node.js 20: actions/checkout@v3, actions/cache@v3. For more information see: https://github.blog/changelog/2023-09-22-github-actions-transitioning-from-node-16-to-node-20/.
macOS 11 gcc with OpenCL
Node.js 16 actions are deprecated. Please update the following actions to use Node.js 20: actions/checkout@v3, actions/cache@v3. For more information see: https://github.blog/changelog/2023-09-22-github-actions-transitioning-from-node-16-to-node-20/.
macOS Latest Clang
Node.js 16 actions are deprecated. Please update the following actions to use Node.js 20: actions/checkout@v3, actions/cache@v3. For more information see: https://github.blog/changelog/2023-09-22-github-actions-transitioning-from-node-16-to-node-20/.
Ubuntu 20.04 ARM64 Clang 10
Node.js 16 actions are deprecated. Please update the following actions to use Node.js 20: actions/checkout@v3, actions/cache@v3. For more information see: https://github.blog/changelog/2023-09-22-github-actions-transitioning-from-node-16-to-node-20/.