Skip to content

Fix lua build with Qbs #746

Fix lua build with Qbs

Fix lua build with Qbs #746

Triggered via push July 27, 2024 14:58
Status Success
Total duration 3h 6m 1s
Artifacts 16

build_cmake.yml

on: push
Matrix: build
Fit to window
Zoom out
Zoom in

Annotations

8 errors and 5 warnings
macOS Latest Clang
97% tests passed, 3 tests failed out of 90 Total Test time (real) = 65.89 sec The following tests FAILED: 14 - tst_cplusplus_cxx11 (Failed) 51 - tst_qml_qmlcodeformatter (Failed) 55 - tst_qml_reformatter (Failed) Errors while running CTest
macOS Latest Clang
Process completed with exit code 1.
Ubuntu Latest GCC
97% tests passed, 3 tests failed out of 95 Total Test time (real) = 29.07 sec The following tests FAILED: 19 - tst_cplusplus_cxx11 (Failed) 56 - tst_qml_qmlcodeformatter (Failed) 60 - tst_qml_reformatter (Failed) Errors while running CTest
Ubuntu Latest GCC
Process completed with exit code 1.
Windows Latest MSVC
97% tests passed, 3 tests failed out of 95 Total Test time (real) = 29.58 sec The following tests FAILED: 19 - tst_cplusplus_cxx11 (Failed) 56 - tst_qml_qmlcodeformatter (Failed) 60 - tst_qml_reformatter (Failed) Errors while running CTest
Windows Latest MSVC
Process completed with exit code 1.
Windows Latest MinGW
97% tests passed, 3 tests failed out of 90 Total Test time (real) = 26.33 sec The following tests FAILED: 14 - tst_cplusplus_cxx11 (Failed) 51 - tst_qml_qmlcodeformatter (Failed) 55 - tst_qml_reformatter (Failed) Errors while running CTest
Windows Latest MinGW
Process completed with exit code 1.
macOS Latest Clang
upx has been deprecated because it is crashing for macOS Ventura or above!
macOS Latest Clang
Restore cache failed: Dependencies file is not found in /Users/runner/work/Qt-Creator/Qt-Creator. Supported file pattern: go.sum
Ubuntu Latest GCC
Restore cache failed: Dependencies file is not found in /home/runner/work/Qt-Creator/Qt-Creator. Supported file pattern: go.sum
Windows Latest MSVC
Restore cache failed: Dependencies file is not found in D:\a\Qt-Creator\Qt-Creator. Supported file pattern: go.sum
Windows Latest MinGW
Restore cache failed: Dependencies file is not found in D:\a\Qt-Creator\Qt-Creator. Supported file pattern: go.sum

Artifacts

Produced during runtime
Name Size
ccache-macos-latest-clang-qtc15 Expired
292 MB
ccache-ubuntu-latest-gcc-qtc15 Expired
183 MB
ccache-windows-latest-cl-qtc15 Expired
401 MB
ccache-windows-latest-gcc-qtc15 Expired
178 MB
qtcreator-linux-x64-10124409466.7z Expired
151 MB
qtcreator-linux-x64-10124409466.deb Expired
142 MB
qtcreator-linux-x64-10124409466_dev.7z Expired
3.73 MB
qtcreator-macos-universal-10124409466.7z Expired
166 MB
qtcreator-macos-universal-10124409466_dev.7z Expired
3.28 MB
qtcreator-windows-x64-mingw-10124409466.7z Expired
121 MB
qtcreator-windows-x64-mingw-10124409466_dev.7z Expired
4.74 MB
qtcreator-windows-x64-msvc-10124409466.7z Expired
115 MB
qtcreator-windows-x64-msvc-10124409466_dev.7z Expired
9.22 MB
qtcreatorcdbext-windows-x64-msvc-10124409466.7z Expired
25.8 MB
wininterrupt-windows-x64-mingw-10124409466.7z Expired
25.3 KB
wininterrupt-windows-x64-msvc-10124409466.7z Expired
4.68 KB